XWINWRAP – Fondo animado de escritorio [Descargar e Instalar]

Youtube esta vez se muy porto mal con la conversión de nuestro videito😛. Pero aun así, podes ver como funciona y tambien podes ver como hace uso del xwinwrap esta nueva version del Screensaver Pluginen Beryl.

En la siguiente imágen podes ver dos de las pestañas de seteos expandidas. Se puede apreciar claramente las opciones del Screensaver Plugin. Podes habilitar Nieve, Lluvia, Negativo, Transparencia y mas segun tu agreado (y recursos de hardware😉 Pero lo mas lindo de todo es que podes cargar un “Accion de Inicio” y una “Accion de Cierre“. Es ahi donde ingresa nuestro actor secundario, el bien conocido por todos xwinwrap!😛

Asi que para cerrar el post te contamos como lo instalamos y como posteriormente le cargamos las acciones para que funcione perfectamente el xwinwrap.

Instalacion
Te bajas el codigo fuente de aquí:
screensaver-plugin.tar.gz
Lo descomprimis con
tar -xvf screensaver-plugin.tar.gz
Cambias a la carpeta que contiene las sources
cd screensaver-plugin
Instalas una dependencia que necesita para compilar:
sudo apt-get install libxss-dev
Y ahora haces el clasico
make && sudo make install
Y Voila! Ya tenemos ultima version de Screensaver plugin.
Lo encontrás en Extras / Screensaver

Y ahora la parte mas divertida, cargarle el xwinwrap
En la primer pestaña expandis la opcion Avanzado y te encontrás con las opciones de Accion de Inicio y de Cierre (Start Up Action y Shutdown Action). Entonces:

Como Shutdown action nosotros siempre pondríamos:
killall xwinwrap
Y como Startup action

Para Videos

xwinwrap -ni -o 1.0 -fs -s -st -sp -b -nf — mplayer -wid WID -quiet /home/tu_nombre_de_usuario/tu_ruta_a_video/tu_video.avi

Para los salvapantallas de linux

Con este commando cargas el clasico salvapantalla de Matrix: xwinwrap -ni -argb -fs -s -st -sp -a -nf — /usr/lib/xscreensaver/glmatrix -window-id WID.

Para los otros salvapantallas solo cambia glmatrix por el que desees cargar (bubble3d, skyrocket, matrixview, solarwinds, etc).


XWINWRAP
Si no tenes xwinwrap instalado hace:
sudo apt-get install xwinwrap
Si no lo encuentra deberias agregar los repos de Treviño:
http://goberylgo.blogspot.com/2007/01/el-gestor-de-ajustes-de-beryl-aparecio.html
(Desde ese link podes configurar tu sources.list con los repositorios necesarios, incluida la llave).

Otra ópcion es bajar el paquete deb directamente: xwinwrap_0.1+cvs20060209_i386.deb

O por último, si sois compilador compulsivo, cosa cada vez más frecuente entre los usuarios de Beryl, entonces deberias hacer lo siguiente:
cvs -d :pserver:anoncvs@cvs.freedesktop.org:/cvs/xapps co xwinwrap
cd xwinwrap
make
sudo cp xwinwrap /usr/bin

[VIDEOS]

13 respuestas a XWINWRAP – Fondo animado de escritorio [Descargar e Instalar]

  1. ricardo dice:

    hola cuando escribo el make && sudo make install me da este error

    -e compiling : screensaver.c -> build/libscreensaver.lo[: 5: ==: unexpected operator
    Package beryl was not found in the pkg-config search path.
    Perhaps you should add the directory containing `beryl.pc’
    to the PKG_CONFIG_PATH environment variable
    No package ‘beryl’ found
    /bin/sh: libtool: not found
    make: *** [build/libscreensaver.lo] Error 127

    no sabes a que se debera esto???

    gracias

  2. h2non dice:

    Bueno, puede que algo de Beryl te este fallando, o que un paquete del programa no haya sido descargado o no este totalmente completo.
    Sinceramente deberias probar otra opción. De todos modos postealo en otros sites por si acaso.

    Suerte!

  3. Kazuma dice:

    H2non yo tmb tenia ese problema, lo que tienes que hacer es instalar de esta manera

    sudo apt-get install libtool
    sudo apt-get install pkg-config

    y de ahi en synaptic pon beryl he instala todos los paquetes posibles de beryl excepto lo que son para gnome en dado caso que uses kde, si usas gnome entonces para gnome y viseversa

  4. Kazuma dice:

    kazuma@kazumalap:~$ cd screensaver-plugin
    kazuma@kazumalap:~/screensaver-plugin$ make&&sudo make install
    -e compiling : screensaver.c -> build/libscreensaver.lo[: 5: ==: unexpected operator
    Package ice was not found in the pkg-config search path.
    Perhaps you should add the directory containing `ice.pc’
    to the PKG_CONFIG_PATH environment variable
    Package ‘ice’, required by ‘beryl’, not found
    screensaver.c:38:23: error: beryl.h: No such file or directory
    screensaver.c:106: warning: implicit declaration of function ‘N_’
    screensaver.c:106: error: initializer element is not constant
    screensaver.c:106: error: (near initialization for ‘saverModes[0]’)
    screensaver.c:182: error: expected specifier-qualifier-list before ‘CompOption’
    screensaver.c:195: error: expected specifier-qualifier-list before ‘CompOption’
    screensaver.c:230: error: expected ‘)’ before ‘*’ token
    screensaver.c:233: error: expected ‘)’ before ‘*’ token
    screensaver.c:236: error: expected ‘)’ before ‘*’ token
    screensaver.c:241: error: expected ‘)’ before ‘*’ token
    screensaver.c:243: error: expected ‘=’, ‘,’, ‘;’, ‘asm’ or ‘__attribute__’ before ‘*’ token
    screensaver.c: In function ‘saverTimeout’:
    screensaver.c:254: error: ‘CompScreen’ undeclared (first use in this function)
    screensaver.c:254: error: (Each undeclared identifier is reported only once
    screensaver.c:254: error: for each function it appears in.)
    screensaver.c:254: error: ‘s’ undeclared (first use in this function)
    screensaver.c:254: error: invalid operands to binary *
    screensaver.c:254: warning: statement with no effect
    screensaver.c:256: error: request for member ‘privates’ in something not a structure or union
    screensaver.c:256: error: request for member ‘display’ in something not a structure or union
    screensaver.c:256: error: request for member ‘privates’ in something not a structure or union
    screensaver.c:256: error: request for member ‘ptr’ in something not a structure or union
    screensaver.c:256: error: request for member ‘ptr’ in something not a structure or union
    screensaver.c:257: error: request for member ‘display’ in something not a structure or union
    screensaver.c:257: error: request for member ‘privates’ in something not a structure or union
    screensaver.c:257: error: request for member ‘ptr’ in something not a structure or union
    screensaver.c:260: error: ‘CompOption’ undeclared (first use in this function)
    screensaver.c:260: warning: statement with no effect
    screensaver.c:260: error: expected ‘;’ before ‘Option’
    screensaver.c:260: error: ‘Option’ undeclared (first use in this function)
    screensaver.c:260: error: request for member ‘type’ in something not a structure or union
    screensaver.c:260: error: ‘CompOptionTypeInt’ undeclared (first use in this function)
    screensaver.c:260: warning: statement with no effect
    screensaver.c:260: error: request for member ‘name’ in something not a structure or union
    screensaver.c:260: warning: statement with no effect
    screensaver.c:260: error: request for member ‘type’ in something not a structure or union
    screensaver.c:260: warning: statement with no effect
    screensaver.c:260: error: request for member ‘name’ in something not a structure or union
    screensaver.c:260: warning: statement with no effect
    screensaver.c:260: error: request for member ‘value’ in something not a structure or union
    screensaver.c:260: error: request for member ‘i’ in something not a structure or union
    screensaver.c:260: error: request for member ‘display’ in something not a structure or union
    screensaver.c:260: error: request for member ‘pointerX’ in something not a structure or union
    screensaver.c:260: warning: statement with no effect
    screensaver.c:260: error: request for member ‘value’ in something not a structure or union
    screensaver.c:260: error: request for member ‘i’ in something not a structure or union
    screensaver.c:260: error: request for member ‘display’ in something not a structure or union
    screensaver.c:260: error: request for member ‘pointerY’ in something not a structure or union
    screensaver.c:260: warning: statement with no effect
    screensaver.c:260: error: request for member ‘type’ in something not a structure or union
    screensaver.c:260: warning: statement with no effect
    screensaver.c:260: error: request for member ‘name’ in something not a structure or union
    screensaver.c:260: warning: statement with no effect
    screensaver.c:260: error: request for member ‘value’ in something not a structure or union
    screensaver.c:260: error: request for member ‘i’ in something not a structure or union
    screensaver.c:260: error: request for member ‘root’ in something not a structure or union
    screensaver.c:260: warning: statement with no effect
    screensaver.c:260: error: request for member ‘type’ in something not a structure or union
    screensaver.c:260: warning: statement with no effect
    screensaver.c:260: error: request for member ‘name’ in something not a structure or union
    screensaver.c:260: warning: statement with no effect
    screensaver.c:260: error: request for member ‘value’ in something not a structure or union
    screensaver.c:260: error: request for member ‘i’ in something not a structure or union
    screensaver.c:260: error: request for member ‘root’ in something not a structure or union
    screensaver.c:260: warning: statement with no effect
    screensaver.c:263: error: request for member ‘hsize’ in something not a structure or union
    screensaver.c:263: warning: initialization makes integer from pointer without a cast
    screensaver.c:265: error: ‘SaverScreen’ has no member named ‘ResetDataVert’
    screensaver.c:265: warning: comparison between pointer and integer
    screensaver.c:266: error: ‘SaverScreen’ has no member named ‘ResetDataVert’
    screensaver.c:266: warning: statement with no effect
    screensaver.c:267: error: ‘SaverScreen’ has no member named ‘ResetDataVert’
    screensaver.c:267: warning: comparison between pointer and integer
    screensaver.c:268: error: ‘SaverScreen’ has no member named ‘ResetDataVert’
    screensaver.c:268: warning: statement with no effect
    screensaver.c:270: error: ‘SaverScreen’ has no member named ‘ResetDataHor’
    screensaver.c:270: warning: comparison between pointer and integer
    screensaver.c:271: error: ‘SaverScreen’ has no member named ‘ResetDataHor’
    screensaver.c:271: warning: statement with no effect
    screensaver.c:272: error: ‘SaverScreen’ has no member named ‘ResetDataHor’
    screensaver.c:272: warning: comparison between pointer and integer
    screensaver.c:273: error: ‘SaverScreen’ has no member named ‘ResetDataHor’
    screensaver.c:273: warning: statement with no effect
    screensaver.c:277: error: ‘SaverDisplay’ has no member named ‘opt’
    screensaver.c:277: error: request for member ‘value’ in something not a structure or union
    screensaver.c:277: error: request for member ‘b’ in something not a structure or union
    screensaver.c:281: error: ‘SaverScreen’ has no member named ‘ResetDataVert’
    screensaver.c:281: error: invalid operands to binary %
    screensaver.c:285: error: ‘SaverScreen’ has no member named ‘ResetDataVert’
    screensaver.c:285: warning: statement with no effect
    screensaver.c:287: error: ‘SaverScreen’ has no member named ‘ResetDataVert’
    screensaver.c:287: warning: statement with no effect
    screensaver.c:290: error: ‘SaverScreen’ has no member named ‘ResetDataHor’
    screensaver.c:290: warning: statement with no effect
    screensaver.c:292: error: ‘SaverScreen’ has no member named ‘ResetDataHor’
    screensaver.c:292: warning: statement with no effect
    screensaver.c:294: error: ‘SaverScreen’ has no member named ‘actions’
    screensaver.c:294: error: request for member ‘value’ in something not a structure or union
    screensaver.c:294: error: request for member ‘action’ in something not a structure or union
    screensaver.c:294: error: request for member ‘initiate’ in something not a structure or union
    screensaver.c:294: error: request for member ‘display’ in something not a structure or union
    screensaver.c:295: error: called object ‘*(&)’ is not a function
    screensaver.c:295: warning: statement with no effect
    screensaver.c:298: error: ‘SaverScreen’ has no member named ‘NegOk’
    screensaver.c:298: error: ‘SaverDisplay’ has no member named ‘opt’
    screensaver.c:298: error: request for member ‘value’ in something not a structure or union
    screensaver.c:298: error: request for member ‘b’ in something not a structure or union
    screensaver.c:299: error: ‘SaverDisplay’ has no member named ‘opt’
    screensaver.c:299: error: request for member ‘value’ in something not a structure or union
    screensaver.c:299: error: request for member ‘b’ in something not a structure or union
    screensaver.c:299: error: invalid operands to binary %
    screensaver.c:300: error: ‘SaverScreen’ has no member named ‘ResetDataNeg’
    screensaver.c:300: error: ‘SaverScreen’ has no member named ‘ResetDataNeg’
    screensaver.c:300: warning: statement with no effect
    screensaver.c:301: error: ‘SaverScreen’ has no member named ‘actions’
    screensaver.c:301: error: request for member ‘value’ in something not a structure or union
    screensaver.c:301: error: request for member ‘action’ in something not a structure or union
    screensaver.c:301: error: request for member ‘initiate’ in something not a structure or union
    screensaver.c:301: error: request for member ‘display’ in something not a structure or union
    screensaver.c:302: error: ‘SaverScreen’ has no member named ‘actions’
    screensaver.c:302: error: request for member ‘value’ in something not a structure or union
    screensaver.c:302: error: request for member ‘action’ in something not a structure or union
    screensaver.c:302: error: called object ‘*(&)’ is not a function
    screensaver.c:302: warning: statement with no effect
    screensaver.c:306: error: ‘TRUE’ undeclared (first use in this function)
    screensaver.c:306: warning: return makes integer from pointer without a cast
    screensaver.c: In function ‘saverTimein’:
    screensaver.c:317: error: ‘CompDisplay’ undeclared (first use in this function)
    screensaver.c:317: error: ‘d’ undeclared (first use in this function)
    screensaver.c:317: error: invalid operands to binary *
    screensaver.c:317: warning: statement with no effect
    screensaver.c:318: error: ‘CompScreen’ undeclared (first use in this function)
    screensaver.c:318: error: ‘s’ undeclared (first use in this function)
    screensaver.c:318: error: invalid operands to binary *
    screensaver.c:318: warning: statement with no effect
    screensaver.c:319: error: request for member ‘privates’ in something not a structure or union
    screensaver.c:319: error: request for member ‘ptr’ in something not a structure or union
    screensaver.c:321: error: ‘SaverDisplay’ has no member named ‘opt’
    screensaver.c:321: error: request for member ‘value’ in something not a structure or union
    screensaver.c:321: error: request for member ‘i’ in something not a structure or union
    screensaver.c:321: error: ‘SaverDisplay’ has no member named ‘opt’
    screensaver.c:321: error: request for member ‘value’ in something not a structure or union
    screensaver.c:321: error: request for member ‘b’ in something not a structure or union
    screensaver.c:321: error: ‘FALSE’ undeclared (first use in this function)
    screensaver.c:322: warning: return makes integer from pointer without a cast
    screensaver.c:324: error: request for member ‘display’ in something not a structure or union
    screensaver.c:327: warning: return makes integer from pointer without a cast
    screensaver.c:337: error: request for member ‘screens’ in something not a structure or union
    screensaver.c:337: warning: statement with no effect
    screensaver.c:351: error: request for member ‘privates’ in something not a structure or union
    screensaver.c:351: error: request for member ‘display’ in something not a structure or union
    screensaver.c:351: error: request for member ‘privates’ in something not a structure or union
    screensaver.c:351: error: request for member ‘ptr’ in something not a structure or union
    screensaver.c:351: error: request for member ‘ptr’ in something not a structure or union
    screensaver.c:353: error: request for member ‘display’ in something not a structure or union
    screensaver.c:353: error: request for member ‘display’ in something not a structure or union
    screensaver.c:353: error: request for member ‘display’ in something not a structure or union
    screensaver.c:353: error: ‘SaverDisplay’ has no member named ‘saver_info’
    screensaver.c:353: warning: passing argument 1 of ‘XScreenSaverQueryInfo’ from incompatible pointer type
    screensaver.c:353: warning: passing argument 3 of ‘XScreenSaverQueryInfo’ from incompatible pointer type
    screensaver.c:354: error: ‘SaverDisplay’ has no member named ‘saver_info’
    screensaver.c:354: error: request for member ‘idle’ in something not a structure or union
    screensaver.c:354: warning: initialization makes integer from pointer without a cast
    screensaver.c:357: warning: return makes integer from pointer without a cast
    screensaver.c:359: error: ‘SaverDisplay’ has no member named ‘opt’
    screensaver.c:359: error: request for member ‘value’ in something not a structure or union
    screensaver.c:359: error: request for member ‘i’ in something not a structure or union
    screensaver.c:359: error: invalid operands to binary *
    screensaver.c:359: error: invalid operands to binary *
    screensaver.c:359: warning: comparison between pointer and integer
    screensaver.c:360: error: ‘SaverScreen’ has no member named ‘screensaverHandleTimeout’
    screensaver.c:361: error: ‘TRUE’ undeclared (first use in this function)
    screensaver.c:361: warning: return makes integer from pointer without a cast
    screensaver.c:362: warning: implicit declaration of function ‘rotateSet’
    screensaver.c:364: error: ‘SaverScreen’ has no member named ‘screensaverHandleTimeout’
    screensaver.c:365: warning: return makes integer from pointer without a cast
    screensaver.c:366: warning: implicit declaration of function ‘rotateReset’
    screensaver.c:369: warning: return makes integer from pointer without a cast
    screensaver.c: At top level:
    screensaver.c:376: error: expected ‘)’ before ‘*’ token
    screensaver.c:427: error: expected ‘)’ before ‘*’ token
    screensaver.c:494: error: expected ‘)’ before ‘*’ token
    screensaver.c: In function ‘saverDisplayInitOptions’:
    screensaver.c:542: error: ‘CompOption’ undeclared (first use in this function)
    screensaver.c:542: error: ‘o’ undeclared (first use in this function)
    screensaver.c:542: error: invalid operands to binary *
    screensaver.c:542: warning: statement with no effect
    screensaver.c:544: error: ‘SaverDisplay’ has no member named ‘opt’
    screensaver.c:544: warning: statement with no effect
    screensaver.c:545: error: request for member ‘name’ in something not a structure or union
    screensaver.c:545: warning: statement with no effect
    screensaver.c:547: error: request for member ‘advanced’ in something not a structure or union
    screensaver.c:547: warning: statement with no effect
    screensaver.c:548: error: request for member ‘group’ in something not a structure or union
    screensaver.c:548: warning: statement with no effect
    screensaver.c:549: error: request for member ‘subGroup’ in something not a structure or union
    screensaver.c:549: warning: statement with no effect
    screensaver.c:550: error: request for member ‘displayHints’ in something not a structure or union
    screensaver.c:550: warning: statement with no effect
    screensaver.c:552: error: request for member ‘shortDesc’ in something not a structure or union
    screensaver.c:552: warning: statement with no effect
    screensaver.c:553: error: request for member ‘longDesc’ in something not a structure or union
    screensaver.c:553: warning: statement with no effect
    screensaver.c:554: error: request for member ‘type’ in something not a structure or union
    screensaver.c:554: error: ‘CompOptionTypeString’ undeclared (first use in this function)
    screensaver.c:554: warning: statement with no effect
    screensaver.c:555: error: request for member ‘value’ in something not a structure or union
    screensaver.c:555: error: request for member ‘s’ in something not a structure or union
    screensaver.c:556: warning: statement with no effect
    screensaver.c:557: error: request for member ‘rest’ in something not a structure or union
    screensaver.c:557: error: request for member ‘s’ in something not a structure or union
    screensaver.c:557: error: request for member ‘string’ in something not a structure or union
    screensaver.c:557: warning: statement with no effect
    screensaver.c:558: error: request for member ‘rest’ in something not a structure or union
    screensaver.c:558: error: request for member ‘s’ in something not a structure or union
    screensaver.c:558: error: request for member ‘nString’ in something not a structure or union
    screensaver.c:558: warning: statement with no effect
    screensaver.c:561: error: ‘SaverDisplay’ has no member named ‘opt’
    screensaver.c:561: warning: statement with no effect
    screensaver.c:562: error: request for member ‘name’ in something not a structure or union
    screensaver.c:562: warning: statement with no effect
    screensaver.c:564: error: request for member ‘advanced’ in something not a structure or union
    screensaver.c:564: error: ‘FALSE’ undeclared (first use in this function)
    screensaver.c:564: warning: statement with no effect
    screensaver.c:565: error: request for member ‘group’ in something not a structure or union
    screensaver.c:565: warning: statement with no effect
    screensaver.c:566: error: request for member ‘subGroup’ in something not a structure or union
    screensaver.c:566: warning: statement with no effect
    screensaver.c:567: error: request for member ‘displayHints’ in something not a structure or union
    screensaver.c:567: warning: statement with no effect
    screensaver.c:569: error: request for member ‘shortDesc’ in something not a structure or union
    screensaver.c:569: warning: statement with no effect
    screensaver.c:570: error: request for member ‘longDesc’ in something not a structure or union
    screensaver.c:570: warning: statement with no effect
    screensaver.c:571: error: request for member ‘type’ in something not a structure or union
    screensaver.c:571: error: ‘CompOptionTypeInt’ undeclared (first use in this function)
    screensaver.c:571: warning: statement with no effect
    screensaver.c:572: error: request for member ‘value’ in something not a structure or union
    screensaver.c:572: error: request for member ‘i’ in something not a structure or union
    screensaver.c:572: warning: statement with no effect
    screensaver.c:573: error: request for member ‘rest’ in something not a structure or union
    screensaver.c:573: error: request for member ‘i’ in something not a structure or union
    screensaver.c:573: error: request for member ‘min’ in something not a structure or union
    screensaver.c:573: warning: statement with no effect
    screensaver.c:574: error: request for member ‘rest’ in something not a structure or union
    screensaver.c:574: error: request for member ‘i’ in something not a structure or union
    screensaver.c:574: error: request for member ‘max’ in something not a structure or union
    screensaver.c:574: warning: statement with no effect
    screensaver.c:577: error: ‘SaverDisplay’ has no member named ‘opt’
    screensaver.c:577: warning: statement with no effect
    screensaver.c:578: error: request for member ‘name’ in something not a structure or union
    screensaver.c:578: warning: statement with no effect
    screensaver.c:580: error: request for member ‘advanced’ in something not a structure or union
    screensaver.c:580: warning: statement with no effect
    screensaver.c:581: error: request for member ‘group’ in something not a structure or union
    screensaver.c:581: warning: statement with no effect
    screensaver.c:582: error: request for member ‘subGroup’ in something not a structure or union
    screensaver.c:582: warning: statement with no effect
    screensaver.c:583: error: request for member ‘displayHints’ in something not a structure or union
    screensaver.c:583: warning: statement with no effect
    screensaver.c:585: error: request for member ‘shortDesc’ in something not a structure or union
    screensaver.c:585: warning: statement with no effect
    screensaver.c:586: error: request for member ‘longDesc’ in something not a structure or union
    screensaver.c:586: warning: statement with no effect
    screensaver.c:587: error: request for member ‘type’ in something not a structure or union
    screensaver.c:587: error: ‘CompOptionTypeAction’ undeclared (first use in this function)
    screensaver.c:587: warning: statement with no effect
    screensaver.c:588: error: request for member ‘value’ in something not a structure or union
    screensaver.c:588: error: request for member ‘action’ in something not a structure or union
    screensaver.c:588: error: request for member ‘initiate’ in something not a structure or union
    screensaver.c:588: error: ‘saverToggleInite’ undeclared (first use in this function)
    screensaver.c:588: warning: statement with no effect
    screensaver.c:589: error: request for member ‘value’ in something not a structure or union
    screensaver.c:589: error: request for member ‘action’ in something not a structure or union
    screensaver.c:589: error: request for member ‘terminate’ in something not a structure or union
    screensaver.c:589: warning: statement with no effect
    screensaver.c:590: error: request for member ‘value’ in something not a structure or union
    screensaver.c:590: error: request for member ‘action’ in something not a structure or union
    screensaver.c:590: error: request for member ‘bell’ in something not a structure or union
    screensaver.c:590: warning: statement with no effect
    screensaver.c:591: error: request for member ‘value’ in something not a structure or union
    screensaver.c:591: error: request for member ‘action’ in something not a structure or union
    screensaver.c:591: error: request for member ‘edgeMask’ in something not a structure or union
    screensaver.c:591: warning: statement with no effect
    screensaver.c:592: error: request for member ‘value’ in something not a structure or union
    screensaver.c:592: error: request for member ‘action’ in something not a structure or union
    screensaver.c:592: error: request for member ‘type’ in something not a structure or union
    screensaver.c:592: error: ‘CompBindingTypeKey’ undeclared (first use in this function)
    screensaver.c:592: warning: statement with no effect
    screensaver.c:593: error: request for member ‘value’ in something not a structure or union
    screensaver.c:593: error: request for member ‘action’ in something not a structure or union
    screensaver.c:593: error: request for member ‘state’ in something not a structure or union
    screensaver.c:593: error: ‘CompActionStateInitKey’ undeclared (first use in this function)
    screensaver.c:593: warning: statement with no effect
    screensaver.c:594: error: request for member ‘value’ in something not a structure or union
    screensaver.c:594: error: request for member ‘action’ in something not a structure or union
    screensaver.c:594: error: request for member ‘key’ in something not a structure or union
    screensaver.c:594: error: request for member ‘modifiers’ in something not a structure or union
    screensaver.c:594: error: ‘CompSuperMask’ undeclared (first use in this function)
    screensaver.c:594: warning: statement with no effect
    screensaver.c:596: error: request for member ‘value’ in something not a structure or union
    screensaver.c:596: error: request for member ‘action’ in something not a structure or union
    screensaver.c:596: error: request for member ‘key’ in something not a structure or union
    screensaver.c:596: error: request for member ‘keysym’ in something not a structure or union
    screensaver.c:598: warning: statement with no effect
    screensaver.c:606: error: ‘SaverDisplay’ has no member named ‘opt’
    screensaver.c:606: warning: statement with no effect
    screensaver.c:607: error: request for member ‘name’ in something not a structure or union
    screensaver.c:607: warning: statement with no effect
    screensaver.c:609: error: request for member ‘advanced’ in something not a structure or union
    screensaver.c:609: warning: statement with no effect
    screensaver.c:610: error: request for member ‘group’ in something not a structure or union
    screensaver.c:610: warning: statement with no effect
    screensaver.c:611: error: request for member ‘subGroup’ in something not a structure or union
    screensaver.c:611: warning: statement with no effect
    screensaver.c:612: error: request for member ‘displayHints’ in something not a structure or union
    screensaver.c:612: warning: statement with no effect
    screensaver.c:614: error: request for member ‘shortDesc’ in something not a structure or union
    screensaver.c:614: warning: statement with no effect
    screensaver.c:615: error: request for member ‘longDesc’ in something not a structure or union
    screensaver.c:615: warning: statement with no effect
    screensaver.c:616: error: request for member ‘type’ in something not a structure or union
    screensaver.c:616: error: ‘CompOptionTypeBool’ undeclared (first use in this function)
    screensaver.c:616: warning: statement with no effect
    screensaver.c:617: error: request for member ‘value’ in something not a structure or union
    screensaver.c:617: error: request for member ‘b’ in something not a structure or union
    screensaver.c:617: error: ‘TRUE’ undeclared (first use in this function)
    screensaver.c:617: warning: statement with no effect
    screensaver.c:620: error: ‘SaverDisplay’ has no member named ‘opt’
    screensaver.c:620: warning: statement with no effect
    screensaver.c:621: error: request for member ‘name’ in something not a structure or union
    screensaver.c:621: warning: statement with no effect
    screensaver.c:623: error: request for member ‘advanced’ in something not a structure or union
    screensaver.c:623: warning: statement with no effect
    screensaver.c:624: error: request for member ‘group’ in something not a structure or union
    screensaver.c:624: warning: statement with no effect
    screensaver.c:625: error: request for member ‘subGroup’ in something not a structure or union
    screensaver.c:625: warning: statement with no effect
    screensaver.c:626: error: request for member ‘displayHints’ in something not a structure or union
    screensaver.c:626: warning: statement with no effect
    screensaver.c:628: error: request for member ‘shortDesc’ in something not a structure or union
    screensaver.c:628: warning: statement with no effect
    screensaver.c:629: error: request for member ‘longDesc’ in something not a structure or union
    screensaver.c:629: warning: statement with no effect
    screensaver.c:630: error: request for member ‘type’ in something not a structure or union
    screensaver.c:630: warning: statement with no effect
    screensaver.c:631: error: request for member ‘value’ in something not a structure or union
    screensaver.c:631: error: request for member ‘b’ in something not a structure or union
    screensaver.c:631: warning: statement with no effect
    screensaver.c:633: error: ‘SaverDisplay’ has no member named ‘opt’
    screensaver.c:633: warning: statement with no effect
    screensaver.c:634: error: request for member ‘name’ in something not a structure or union
    screensaver.c:634: warning: statement with no effect
    screensaver.c:636: error: request for member ‘advanced’ in something not a structure or union
    screensaver.c:636: warning: statement with no effect
    screensaver.c:637: error: request for member ‘group’ in something not a structure or union
    screensaver.c:637: warning: statement with no effect
    screensaver.c:638: error: request for member ‘subGroup’ in something not a structure or union
    screensaver.c:638: warning: statement with no effect
    screensaver.c:639: error: request for member ‘displayHints’ in something not a structure or union
    screensaver.c:639: warning: statement with no effect
    screensaver.c:641: error: request for member ‘shortDesc’ in something not a structure or union
    screensaver.c:641: warning: statement with no effect
    screensaver.c:642: error: request for member ‘longDesc’ in something not a structure or union
    screensaver.c:642: warning: statement with no effect
    screensaver.c:643: error: request for member ‘type’ in something not a structure or union
    screensaver.c:643: warning: statement with no effect
    screensaver.c:644: error: request for member ‘value’ in something not a structure or union
    screensaver.c:644: error: request for member ‘b’ in something not a structure or union
    screensaver.c:644: warning: statement with no effect
    screensaver.c:646: error: ‘SaverDisplay’ has no member named ‘opt’
    screensaver.c:646: warning: statement with no effect
    screensaver.c:647: error: request for member ‘name’ in something not a structure or union
    screensaver.c:647: warning: statement with no effect
    screensaver.c:649: error: request for member ‘advanced’ in something not a structure or union
    screensaver.c:649: warning: statement with no effect
    screensaver.c:650: error: request for member ‘group’ in something not a structure or union
    screensaver.c:650: warning: statement with no effect
    screensaver.c:651: error: request for member ‘subGroup’ in something not a structure or union
    screensaver.c:651: warning: statement with no effect
    screensaver.c:652: error: request for member ‘displayHints’ in something not a structure or union
    screensaver.c:652: warning: statement with no effect
    screensaver.c:654: error: request for member ‘shortDesc’ in something not a structure or union
    screensaver.c:654: warning: statement with no effect
    screensaver.c:655: error: request for member ‘longDesc’ in something not a structure or union
    screensaver.c:655: warning: statement with no effect
    screensaver.c:656: error: request for member ‘type’ in something not a structure or union
    screensaver.c:656: warning: statement with no effect
    screensaver.c:657: error: request for member ‘value’ in something not a structure or union
    screensaver.c:657: error: request for member ‘b’ in something not a structure or union
    screensaver.c:657: warning: statement with no effect
    screensaver.c:659: error: ‘SaverDisplay’ has no member named ‘opt’
    screensaver.c:659: warning: statement with no effect
    screensaver.c:660: error: request for member ‘name’ in something not a structure or union
    screensaver.c:660: warning: statement with no effect
    screensaver.c:662: error: request for member ‘advanced’ in something not a structure or union
    screensaver.c:662: warning: statement with no effect
    screensaver.c:663: error: request for member ‘group’ in something not a structure or union
    screensaver.c:663: warning: statement with no effect
    screensaver.c:664: error: request for member ‘subGroup’ in something not a structure or union
    screensaver.c:664: warning: statement with no effect
    screensaver.c:665: error: request for member ‘displayHints’ in something not a structure or union
    screensaver.c:665: warning: statement with no effect
    screensaver.c:667: error: request for member ‘shortDesc’ in something not a structure or union
    screensaver.c:667: warning: statement with no effect
    screensaver.c:668: error: request for member ‘longDesc’ in something not a structure or union
    screensaver.c:668: warning: statement with no effect
    screensaver.c:669: error: request for member ‘type’ in something not a structure or union
    screensaver.c:669: warning: statement with no effect
    screensaver.c:670: error: request for member ‘value’ in something not a structure or union
    screensaver.c:670: error: request for member ‘b’ in something not a structure or union
    screensaver.c:670: warning: statement with no effect
    screensaver.c:673: error: ‘SaverDisplay’ has no member named ‘opt’
    screensaver.c:673: warning: statement with no effect
    screensaver.c:674: error: request for member ‘name’ in something not a structure or union
    screensaver.c:674: warning: statement with no effect
    screensaver.c:676: error: request for member ‘advanced’ in something not a structure or union
    screensaver.c:676: warning: statement with no effect
    screensaver.c:677: error: request for member ‘group’ in something not a structure or union
    screensaver.c:677: warning: statement with no effect
    screensaver.c:678: error: request for member ‘subGroup’ in something not a structure or union
    screensaver.c:678: warning: statement with no effect
    screensaver.c:679: error: request for member ‘displayHints’ in something not a structure or union
    screensaver.c:679: warning: statement with no effect
    screensaver.c:681: error: request for member ‘shortDesc’ in something not a structure or union
    screensaver.c:681: warning: statement with no effect
    screensaver.c:682: error: request for member ‘longDesc’ in something not a structure or union
    screensaver.c:682: warning: statement with no effect
    screensaver.c:683: error: request for member ‘type’ in something not a structure or union
    screensaver.c:683: warning: statement with no effect
    screensaver.c:684: error: request for member ‘value’ in something not a structure or union
    screensaver.c:684: error: request for member ‘i’ in something not a structure or union
    screensaver.c:684: warning: statement with no effect
    screensaver.c:685: error: request for member ‘rest’ in something not a structure or union
    screensaver.c:685: error: request for member ‘i’ in something not a structure or union
    screensaver.c:685: error: request for member ‘min’ in something not a structure or union
    screensaver.c:685: warning: statement with no effect
    screensaver.c:686: error: request for member ‘rest’ in something not a structure or union
    screensaver.c:686: error: request for member ‘i’ in something not a structure or union
    screensaver.c:686: error: request for member ‘max’ in something not a structure or union
    screensaver.c:686: warning: statement with no effect
    screensaver.c:689: error: ‘SaverDisplay’ has no member named ‘opt’
    screensaver.c:689: warning: statement with no effect
    screensaver.c:690: error: request for member ‘name’ in something not a structure or union
    screensaver.c:690: warning: statement with no effect
    screensaver.c:692: error: request for member ‘advanced’ in something not a structure or union
    screensaver.c:692: warning: statement with no effect
    screensaver.c:693: error: request for member ‘group’ in something not a structure or union
    screensaver.c:693: warning: statement with no effect
    screensaver.c:694: error: request for member ‘subGroup’ in something not a structure or union
    screensaver.c:694: warning: statement with no effect
    screensaver.c:695: error: request for member ‘displayHints’ in something not a structure or union
    screensaver.c:695: warning: statement with no effect
    screensaver.c:697: error: request for member ‘shortDesc’ in something not a structure or union
    screensaver.c:697: warning: statement with no effect
    screensaver.c:698: error: request for member ‘longDesc’ in something not a structure or union
    screensaver.c:698: warning: statement with no effect
    screensaver.c:699: error: request for member ‘type’ in something not a structure or union
    screensaver.c:699: warning: statement with no effect
    screensaver.c:700: error: request for member ‘value’ in something not a structure or union
    screensaver.c:700: error: request for member ‘b’ in something not a structure or union
    screensaver.c:700: warning: statement with no effect
    screensaver.c:703: error: ‘SaverDisplay’ has no member named ‘opt’
    screensaver.c:703: warning: statement with no effect
    screensaver.c:704: error: request for member ‘name’ in something not a structure or union
    screensaver.c:704: warning: statement with no effect
    screensaver.c:706: error: request for member ‘advanced’ in something not a structure or union
    screensaver.c:706: warning: statement with no effect
    screensaver.c:707: error: request for member ‘group’ in something not a structure or union
    screensaver.c:707: warning: statement with no effect
    screensaver.c:708: error: request for member ‘subGroup’ in something not a structure or union
    screensaver.c:708: warning: statement with no effect
    screensaver.c:709: error: request for member ‘displayHints’ in something not a structure or union
    screensaver.c:709: warning: statement with no effect
    screensaver.c:711: error: request for member ‘shortDesc’ in something not a structure or union
    screensaver.c:711: warning: statement with no effect
    screensaver.c:712: error: request for member ‘longDesc’ in something not a structure or union
    screensaver.c:712: warning: statement with no effect
    screensaver.c:713: error: request for member ‘type’ in something not a structure or union
    screensaver.c:713: warning: statement with no effect
    screensaver.c:714: error: request for member ‘value’ in something not a structure or union
    screensaver.c:714: error: request for member ‘i’ in something not a structure or union
    screensaver.c:714: warning: statement with no effect
    screensaver.c:715: error: request for member ‘rest’ in something not a structure or union
    screensaver.c:715: error: request for member ‘i’ in something not a structure or union
    screensaver.c:715: error: request for member ‘min’ in something not a structure or union
    screensaver.c:715: warning: statement with no effect
    screensaver.c:716: error: request for member ‘rest’ in something not a structure or union
    screensaver.c:716: error: request for member ‘i’ in something not a structure or union
    screensaver.c:716: error: request for member ‘max’ in something not a structure or union
    screensaver.c:716: warning: statement with no effect
    screensaver.c:719: error: ‘SaverDisplay’ has no member named ‘opt’
    screensaver.c:719: warning: statement with no effect
    screensaver.c:720: error: request for member ‘name’ in something not a structure or union
    screensaver.c:720: warning: statement with no effect
    screensaver.c:722: error: request for member ‘advanced’ in something not a structure or union
    screensaver.c:722: warning: statement with no effect
    screensaver.c:723: error: request for member ‘group’ in something not a structure or union
    screensaver.c:723: warning: statement with no effect
    screensaver.c:724: error: request for member ‘subGroup’ in something not a structure or union
    screensaver.c:724: warning: statement with no effect
    screensaver.c:725: error: request for member ‘displayHints’ in something not a structure or union
    screensaver.c:725: warning: statement with no effect
    screensaver.c:727: error: request for member ‘shortDesc’ in something not a structure or union
    screensaver.c:727: warning: statement with no effect
    screensaver.c:728: error: request for member ‘longDesc’ in something not a structure or union
    screensaver.c:728: warning: statement with no effect
    screensaver.c:729: error: request for member ‘type’ in something not a structure or union
    screensaver.c:729: warning: statement with no effect
    screensaver.c:730: error: request for member ‘value’ in something not a structure or union
    screensaver.c:730: error: request for member ‘b’ in something not a structure or union
    screensaver.c:730: warning: statement with no effect
    screensaver.c:733: error: ‘SaverDisplay’ has no member named ‘opt’
    screensaver.c:733: warning: statement with no effect
    screensaver.c:734: error: request for member ‘name’ in something not a structure or union
    screensaver.c:734: warning: statement with no effect
    screensaver.c:736: error: request for member ‘advanced’ in something not a structure or union
    screensaver.c:736: warning: statement with no effect
    screensaver.c:737: error: request for member ‘group’ in something not a structure or union
    screensaver.c:737: warning: statement with no effect
    screensaver.c:738: error: request for member ‘subGroup’ in something not a structure or union
    screensaver.c:738: warning: statement with no effect
    screensaver.c:739: error: request for member ‘displayHints’ in something not a structure or union
    screensaver.c:739: warning: statement with no effect
    screensaver.c:741: error: request for member ‘shortDesc’ in something not a structure or union
    screensaver.c:741: warning: statement with no effect
    screensaver.c:742: error: request for member ‘longDesc’ in something not a structure or union
    screensaver.c:742: warning: statement with no effect
    screensaver.c:743: error: request for member ‘type’ in something not a structure or union
    screensaver.c:743: warning: statement with no effect
    screensaver.c:744: error: request for member ‘value’ in something not a structure or union
    screensaver.c:744: error: request for member ‘s’ in something not a structure or union
    screensaver.c:744: warning: statement with no effect
    screensaver.c:745: error: request for member ‘rest’ in something not a structure or union
    screensaver.c:745: error: request for member ‘s’ in something not a structure or union
    screensaver.c:745: error: request for member ‘string’ in something not a structure or union
    screensaver.c:745: warning: statement with no effect
    screensaver.c:746: error: request for member ‘rest’ in something not a structure or union
    screensaver.c:746: error: request for member ‘s’ in something not a structure or union
    screensaver.c:746: error: request for member ‘nString’ in something not a structure or union
    screensaver.c:746: warning: statement with no effect
    screensaver.c:748: error: ‘SaverDisplay’ has no member named ‘opt’
    screensaver.c:748: warning: statement with no effect
    screensaver.c:749: error: request for member ‘name’ in something not a structure or union
    screensaver.c:749: warning: statement with no effect
    screensaver.c:751: error: request for member ‘advanced’ in something not a structure or union
    screensaver.c:751: warning: statement with no effect
    screensaver.c:752: error: request for member ‘group’ in something not a structure or union
    screensaver.c:752: warning: statement with no effect
    screensaver.c:753: error: request for member ‘subGroup’ in something not a structure or union
    screensaver.c:753: warning: statement with no effect
    screensaver.c:754: error: request for member ‘displayHints’ in something not a structure or union
    screensaver.c:754: warning: statement with no effect
    screensaver.c:756: error: request for member ‘shortDesc’ in something not a structure or union
    screensaver.c:756: warning: statement with no effect
    screensaver.c:757: error: request for member ‘longDesc’ in something not a structure or union
    screensaver.c:757: warning: statement with no effect
    screensaver.c:758: error: request for member ‘type’ in something not a structure or union
    screensaver.c:758: warning: statement with no effect
    screensaver.c:759: error: request for member ‘value’ in something not a structure or union
    screensaver.c:759: error: request for member ‘s’ in something not a structure or union
    screensaver.c:759: warning: statement with no effect
    screensaver.c:760: error: request for member ‘rest’ in something not a structure or union
    screensaver.c:760: error: request for member ‘s’ in something not a structure or union
    screensaver.c:760: error: request for member ‘string’ in something not a structure or union
    screensaver.c:760: warning: statement with no effect
    screensaver.c:761: error: request for member ‘rest’ in something not a structure or union
    screensaver.c:761: error: request for member ‘s’ in something not a structure or union
    screensaver.c:761: error: request for member ‘nString’ in something not a structure or union
    screensaver.c:761: warning: statement with no effect
    screensaver.c: At top level:
    screensaver.c:765: error: expected ‘=’, ‘,’, ‘;’, ‘asm’ or ‘__attribute__’ before ‘*’ token
    screensaver.c:788: error: expected ‘)’ before ‘*’ token
    screensaver.c:853: error: expected ‘=’, ‘,’, ‘;’, ‘asm’ or ‘__attribute__’ before ‘*’ token
    screensaver.c:902: error: expected ‘)’ before ‘*’ token
    screensaver.c:939: error: expected ‘)’ before ‘*’ token
    screensaver.c:1012: error: expected ‘)’ before ‘*’ token
    screensaver.c:1022: error: expected ‘)’ before ‘*’ token
    screensaver.c:1048: error: expected ‘)’ before ‘*’ token
    screensaver.c:1064: error: expected ‘)’ before ‘*’ token
    screensaver.c:1076: error: expected ‘)’ before ‘*’ token
    screensaver.c:1083: error: expected ‘=’, ‘,’, ‘;’, ‘asm’ or ‘__attribute__’ before ‘saverDeps’
    screensaver.c:1104: error: expected ‘=’, ‘,’, ‘;’, ‘asm’ or ‘__attribute__’ before ‘saverVTable’
    screensaver.c:1136: error: expected ‘=’, ‘,’, ‘;’, ‘asm’ or ‘__attribute__’ before ‘*’ token
    make: *** [build/libscreensaver.lo] Error 1
    Ese es mi error que hago?

  5. Bernardo dice:

    hola perdona la molestia pero soy totalmente new en ubuntu y la verdad me gustaria saver como poner el pugin pero no entiendo q es source ni como descomprimirlo y me pregunto si me podrias ayudar y de antemano muchas gracias hay si me puedes mandar un mail te lo agradeceria gracias

  6. Ghz dice:

    Wenass a todos, Ricardo, Kazuma yo tengo el mismo puto problema y llevo ya todo el puto dia dandole vueltas, fijo que sera una bobada algo como que beryl esta puesto en otra ruta que no es la asignada al plugin este y como no la encuentra da los problemas. Por hoy lo dejo pero mañana sigo con ello. Si alguien nos puede dar alguna pista …. gracias. Aunque despues de un sueño quizas lo veamos todos distinto.

  7. J@G$.co.cr dice:

    Hola, Kazuma y Ghz estoy igual que ustedes, si pudieron resolverlo o alguien me puede ayudar, soy todo oidos muchas gracias.

  8. jhonny dice:

    ya lo instale pero a la ora de correrlo solo se mueve e cubo no me da ningun efecto de matris como fondo de pantalla alguien me puede ayudare ?

  9. Darth_Salva dice:

    Ya logré instalar el plugin y el xwinwrap, también me pasaron los 2 errores que mencionan…
    El primero me dió solución Kazuma (gracias).

    Y para resolver el 2do bastó con instalar los paquetes de desarrollo beryl (Beryl-dev) desde synaptics.

  10. Álvaro dice:

    En el vídeo ese de el medio (el de Matrix) cual es la canción que se escucha

  11. Álvaro dice:

    En el vídeo del medio (el de Matrix) ¿cuál es la canción que se escucha?

  12. juankd dice:

    Tonces a todos,
    Instale el xwinwrap para intrepid, pero esta vaina no me kiere jalar bien, aclaro no instale los plugins de screensaver ke dice ahy porke dice error o algo asi.

    despues de instalar el mk, xwinwrap le meti el codigo:
    xwinwrap -ni -argb -fs -s -st -sp -a -nf — /usr/lib/xscreensaver/glmatrix -window-id WID

    pero nada ese mk se me pone la pantalla negra y como si estuviera intentando cambiar la resolucion, no se si tenga ke ver ke instale un programa para hacer un efecto ke se llama el cubethemer y el mk tampoco me jalo, o tambien ke en el compiz tengo gtk windows decorator y no se como deseleccionarlo…bueno porfa si pueden colaborarme les agradeceria…tooo bien gracias..

  13. djito dice:

    ese hijo de p te hecho a perder con ese mensajote

Responder

Introduce tus datos o haz clic en un icono para iniciar sesión:

Logo de WordPress.com

Estás comentando usando tu cuenta de WordPress.com. Cerrar sesión / Cambiar )

Imagen de Twitter

Estás comentando usando tu cuenta de Twitter. Cerrar sesión / Cambiar )

Foto de Facebook

Estás comentando usando tu cuenta de Facebook. Cerrar sesión / Cambiar )

Google+ photo

Estás comentando usando tu cuenta de Google+. Cerrar sesión / Cambiar )

Conectando a %s

A %d blogueros les gusta esto: